{"text_format":"3","workbook":"xlsx","n_sheets":3,"sheets":["Forecast","Actuals","Guide"],"read":"whole","date_system":"1900"}

{"sheet":"Forecast","index":0,"n_rows":48,"n_cols":15,"rows_kept":48}
[]
[null,"BriQs Group: 13-week cash forecast",{"$nulls":10},"Case selected:",null,{"$f":"CHOOSE('Forecast'!$O$4,\"Base\",\"Downside\")","v":"Base"}]
[]
[null,"Start week (Monday)","2026-09-14",null,null,"Opening cash (EUR)",null,{"v":42000,"d":"€42,000"},null,"Minimum cash (EUR)",null,{"v":15000,"d":"€15,000"},null,"Case number",1]
[null,"Yellow cells are editable. Enter zero when no cash is expected. See Guide before rolling the dates.",{"$nulls":10},"1 = Base, 2 = Downside"]
[]
[null,"Lowest closing cash",{"$nulls":3},"Weeks below minimum",{"$nulls":4},"Week 13 closing cash"]
[null,{"$f":"IF(COUNT(C26:O26)=13,MIN(C26:O26),\"Missing input\")","v":{"v":22000,"d":"€22,000"}},{"$nulls":3},{"$f":"IF(COUNT(C28:O28)=13,COUNTIFS(C28:O28,\"<0\"),\"Missing input\")","v":0},{"$nulls":4},{"$f":"O26","v":{"v":48000,"d":"€48,000"}}]
[]
[null,"EUR, whole amounts. The supplied forecast and actuals are an original synthetic example. Replace them with your own figures."]
[]
[null,"Week starting (EUR)",{"$f":"$C$4","v":"2026-09-14"},{"$f":"C12+7","v":"2026-09-21"},{"$f":"D12+7","v":"2026-09-28"},{"$f":"E12+7","v":"2026-10-05"},{"$f":"F12+7","v":"2026-10-12"},{"$f":"G12+7","v":"2026-10-19"},{"$f":"H12+7","v":"2026-10-26"},{"$f":"I12+7","v":"2026-11-02"},{"$f":"J12+7","v":"2026-11-09"},{"$f":"K12+7","v":"2026-11-16"},{"$f":"L12+7","v":"2026-11-23"},{"$f":"M12+7","v":"2026-11-30"},{"$f":"N12+7","v":"2026-12-07"}]
[null,"Opening cash",{"$f":"IF(ISNUMBER($H$4),$H$4,\"n.a.\")","v":{"v":42000,"d":"€42,000"}},{"$f":"C26","v":{"v":35000,"d":"€35,000"}},{"$f":"D26","v":{"v":40000,"d":"€40,000"}},{"$f":"E26","v":{"v":22000,"d":"€22,000"}},{"$f":"F26","v":{"v":40000,"d":"€40,000"}},{"$f":"G26","v":{"v":34000,"d":"€34,000"}},{"$f":"H26","v":{"v":41000,"d":"€41,000"}},{"$f":"I26","v":{"v":36000,"d":"€36,000"}},{"$f":"J26","v":{"v":46000,"d":"€46,000"}},{"$f":"K26","v":{"v":37000,"d":"€37,000"}},{"$f":"L26","v":{"v":48000,"d":"€48,000"}},{"$f":"M26","v":{"v":49000,"d":"€49,000"}},{"$f":"N26","v":{"v":47000,"d":"€47,000"}}]
[null,"Customer collections",{"$f":"C34","v":{"v":20000,"d":"20,000"}},{"$f":"D34","v":{"v":28000,"d":"28,000"}},{"$f":"E34","v":{"v":18000,"d":"18,000"}},{"$f":"F34","v":{"v":32000,"d":"32,000"}},{"$f":"G34","v":{"v":27000,"d":"27,000"}},{"$f":"H34","v":{"v":22000,"d":"22,000"}},{"$f":"I34","v":{"v":34000,"d":"34,000"}},{"$f":"J34","v":{"v":26000,"d":"26,000"}},{"$f":"K34","v":{"v":24000,"d":"24,000"}},{"$f":"L34","v":{"v":36000,"d":"36,000"}},{"$f":"M34","v":{"v":30000,"d":"30,000"}},{"$f":"N34","v":{"v":28000,"d":"28,000"}},{"$f":"O34","v":{"v":38000,"d":"38,000"}}]
[null,"Other cash receipts",{"$f":"IF(ISNUMBER(C38),C38,\"n.a.\")","v":0},{"$f":"IF(ISNUMBER(D38),D38,\"n.a.\")","v":0},{"$f":"IF(ISNUMBER(E38),E38,\"n.a.\")","v":0},{"$f":"IF(ISNUMBER(F38),F38,\"n.a.\")","v":0},{"$f":"IF(ISNUMBER(G38),G38,\"n.a.\")","v":0},{"$f":"IF(ISNUMBER(H38),H38,\"n.a.\")","v":{"v":5000,"d":"5,000"}},{"$f":"IF(ISNUMBER(I38),I38,\"n.a.\")","v":0},{"$f":"IF(ISNUMBER(J38),J38,\"n.a.\")","v":0},{"$f":"IF(ISNUMBER(K38),K38,\"n.a.\")","v":0},{"$f":"IF(ISNUMBER(L38),L38,\"n.a.\")","v":{"v":2000,"d":"2,000"}},{"$f":"IF(ISNUMBER(M38),M38,\"n.a.\")","v":0},{"$f":"IF(ISNUMBER(N38),N38,\"n.a.\")","v":0},{"$f":"IF(ISNUMBER(O38),O38,\"n.a.\")","v":0}]
[null,"Total cash receipts",{"$f":"IF(COUNT(C14:C15)=2,SUM(C14:C15),\"n.a.\")","v":{"v":20000,"d":"€20,000"}},{"$f":"IF(COUNT(D14:D15)=2,SUM(D14:D15),\"n.a.\")","v":{"v":28000,"d":"€28,000"}},{"$f":"IF(COUNT(E14:E15)=2,SUM(E14:E15),\"n.a.\")","v":{"v":18000,"d":"€18,000"}},{"$f":"IF(COUNT(F14:F15)=2,SUM(F14:F15),\"n.a.\")","v":{"v":32000,"d":"€32,000"}},{"$f":"IF(COUNT(G14:G15)=2,SUM(G14:G15),\"n.a.\")","v":{"v":27000,"d":"€27,000"}},{"$f":"IF(COUNT(H14:H15)=2,SUM(H14:H15),\"n.a.\")","v":{"v":27000,"d":"€27,000"}},{"$f":"IF(COUNT(I14:I15)=2,SUM(I14:I15),\"n.a.\")","v":{"v":34000,"d":"€34,000"}},{"$f":"IF(COUNT(J14:J15)=2,SUM(J14:J15),\"n.a.\")","v":{"v":26000,"d":"€26,000"}},{"$f":"IF(COUNT(K14:K15)=2,SUM(K14:K15),\"n.a.\")","v":{"v":24000,"d":"€24,000"}},{"$f":"IF(COUNT(L14:L15)=2,SUM(L14:L15),\"n.a.\")","v":{"v":38000,"d":"€38,000"}},{"$f":"IF(COUNT(M14:M15)=2,SUM(M14:M15),\"n.a.\")","v":{"v":30000,"d":"€30,000"}},{"$f":"IF(COUNT(N14:N15)=2,SUM(N14:N15),\"n.a.\")","v":{"v":28000,"d":"€28,000"}},{"$f":"IF(COUNT(O14:O15)=2,SUM(O14:O15),\"n.a.\")","v":{"v":38000,"d":"€38,000"}}]
[]
[null,"Supplier payments",{"$f":"IF(ISNUMBER(C41),C41,\"n.a.\")","v":{"v":12000,"d":"12,000"}},{"$f":"IF(ISNUMBER(D41),D41,\"n.a.\")","v":{"v":16000,"d":"16,000"}},{"$f":"IF(ISNUMBER(E41),E41,\"n.a.\")","v":{"v":18000,"d":"18,000"}},{"$f":"IF(ISNUMBER(F41),F41,\"n.a.\")","v":{"v":14000,"d":"14,000"}},{"$f":"IF(ISNUMBER(G41),G41,\"n.a.\")","v":{"v":18000,"d":"18,000"}},{"$f":"IF(ISNUMBER(H41),H41,\"n.a.\")","v":{"v":14000,"d":"14,000"}},{"$f":"IF(ISNUMBER(I41),I41,\"n.a.\")","v":{"v":19000,"d":"19,000"}},{"$f":"IF(ISNUMBER(J41),J41,\"n.a.\")","v":{"v":16000,"d":"16,000"}},{"$f":"IF(ISNUMBER(K41),K41,\"n.a.\")","v":{"v":18000,"d":"18,000"}},{"$f":"IF(ISNUMBER(L41),L41,\"n.a.\")","v":{"v":20000,"d":"20,000"}},{"$f":"IF(ISNUMBER(M41),M41,\"n.a.\")","v":{"v":19000,"d":"19,000"}},{"$f":"IF(ISNUMBER(N41),N41,\"n.a.\")","v":{"v":18000,"d":"18,000"}},{"$f":"IF(ISNUMBER(O41),O41,\"n.a.\")","v":{"v":22000,"d":"22,000"}}]
[null,"Payroll payments",{"$f":"IF(ISNUMBER(C42),C42,\"n.a.\")","v":{"v":10000,"d":"10,000"}},{"$f":"IF(ISNUMBER(D42),D42,\"n.a.\")","v":0},{"$f":"IF(ISNUMBER(E42),E42,\"n.a.\")","v":{"v":10000,"d":"10,000"}},{"$f":"IF(ISNUMBER(F42),F42,\"n.a.\")","v":0},{"$f":"IF(ISNUMBER(G42),G42,\"n.a.\")","v":{"v":10000,"d":"10,000"}},{"$f":"IF(ISNUMBER(H42),H42,\"n.a.\")","v":0},{"$f":"IF(ISNUMBER(I42),I42,\"n.a.\")","v":{"v":10000,"d":"10,000"}},{"$f":"IF(ISNUMBER(J42),J42,\"n.a.\")","v":0},{"$f":"IF(ISNUMBER(K42),K42,\"n.a.\")","v":{"v":10000,"d":"10,000"}},{"$f":"IF(ISNUMBER(L42),L42,\"n.a.\")","v":0},{"$f":"IF(ISNUMBER(M42),M42,\"n.a.\")","v":{"v":10000,"d":"10,000"}},{"$f":"IF(ISNUMBER(N42),N42,\"n.a.\")","v":0},{"$f":"IF(ISNUMBER(O42),O42,\"n.a.\")","v":{"v":10000,"d":"10,000"}}]
[null,"Rent and utilities",{"$f":"IF(ISNUMBER(C43),C43,\"n.a.\")","v":{"v":3000,"d":"3,000"}},{"$f":"IF(ISNUMBER(D43),D43,\"n.a.\")","v":0},{"$f":"IF(ISNUMBER(E43),E43,\"n.a.\")","v":0},{"$f":"IF(ISNUMBER(F43),F43,\"n.a.\")","v":0},{"$f":"IF(ISNUMBER(G43),G43,\"n.a.\")","v":{"v":3000,"d":"3,000"}},{"$f":"IF(ISNUMBER(H43),H43,\"n.a.\")","v":0},{"$f":"IF(ISNUMBER(I43),I43,\"n.a.\")","v":0},{"$f":"IF(ISNUMBER(J43),J43,\"n.a.\")","v":0},{"$f":"IF(ISNUMBER(K43),K43,\"n.a.\")","v":{"v":3000,"d":"3,000"}},{"$f":"IF(ISNUMBER(L43),L43,\"n.a.\")","v":0},{"$f":"IF(ISNUMBER(M43),M43,\"n.a.\")","v":0},{"$f":"IF(ISNUMBER(N43),N43,\"n.a.\")","v":0},{"$f":"IF(ISNUMBER(O43),O43,\"n.a.\")","v":{"v":3000,"d":"3,000"}}]
{"$rows_left_out":29}
{"sheet":"Actuals","index":1,"n_rows":32,"n_cols":11,"rows_kept":32}
[]
[null,"BriQs Group: forecast vs actuals",{"$nulls":6},"Case selected:",null,{"$f":"CHOOSE('Forecast'!$O$4,\"Base\",\"Downside\")","v":"Base"}]
[]
[{"$nulls":5},"Opening bank cash (EUR)",null,{"v":42000,"d":"€42,000"}]
[null,"Enter actual cash totals and bank balances in yellow cells. Actual dates stay fixed when Forecast dates change."]
[]
[null,"Bank closes entered",{"$nulls":3},"Completed actual weeks",null,null,"Reconciliation differences"]
[null,{"$f":"COUNT(F13:F25)","v":3},{"$nulls":3},{"$f":"COUNT(J13:J25)","v":3},null,null,{"$f":"COUNTIFS(J13:J25,\">0.01\")+COUNTIFS(J13:J25,\"<-0.01\")","v":0}]
[]
[null,"Positive closing variance means more cash than forecast. Reconciliation should be zero for each completed week."]
[]
[null,"Week starting","Forecast closing","Actual receipts","Actual payments","Bank closing","Closing variance","Variance %","Expected closing","Reconciliation","Status"]
[null,"2026-09-14",{"$f":"IF(COUNTIFS('Forecast'!$C$12:$O$12,B13)=1,INDEX('Forecast'!$C$26:$O$26,1,MATCH(B13,'Forecast'!$C$12:$O$12,0)),\"Outside forecast\")","v":{"v":35000,"d":"€35,000"}},{"v":18000,"d":"€18,000"},{"v":27000,"d":"€27,000"},{"v":33000,"d":"€33,000"},{"$f":"IF(ISNUMBER(F13),IF(ISNUMBER(C13),F13-C13,\"n.a.\"),\"No actual\")","v":{"v":-2000,"d":"(€2,000)"}},{"$f":"IF(ISNUMBER(G13),IF(C13=0,\"n.a.\",G13/ABS(C13)),\"n.a.\")","v":{"v":-0.05714285714285714,"d":"(5.7%)"}},{"$f":"IF(COUNT(D13:E13)=2,IF(ISNUMBER($H$4),$H$4+D13-E13,\"n.a.\"),\"n.a.\")","v":{"v":33000,"d":"€33,000"}},{"$f":"IF(COUNT(F13,I13)=2,F13-I13,\"n.a.\")","v":{"v":0,"d":"0.00"}},{"$f":"IF(COUNT(D13:F13)=0,\"No actual entered\",IF(COUNT(D13:F13)<3,\"Complete yellow inputs\",IF(ISNUMBER(I13),IF(ABS(F13-I13)>0.01,\"Reconcile bank difference\",\"Recorded\"),\"Prior opening cash needed\")))","v":"Recorded"}]
[null,"2026-09-21",{"$f":"IF(COUNTIFS('Forecast'!$C$12:$O$12,B14)=1,INDEX('Forecast'!$C$26:$O$26,1,MATCH(B14,'Forecast'!$C$12:$O$12,0)),\"Outside forecast\")","v":{"v":40000,"d":"€40,000"}},{"v":30000,"d":"€30,000"},{"v":23000,"d":"€23,000"},{"v":40000,"d":"€40,000"},{"$f":"IF(ISNUMBER(F14),IF(ISNUMBER(C14),F14-C14,\"n.a.\"),\"No actual\")","v":0},{"$f":"IF(ISNUMBER(G14),IF(C14=0,\"n.a.\",G14/ABS(C14)),\"n.a.\")","v":0},{"$f":"IF(COUNT(D14:E14)=2,IF(AND(ISNUMBER(F13),B14=B13+7),F13+D14-E14,\"n.a.\"),\"n.a.\")","v":{"v":40000,"d":"€40,000"}},{"$f":"IF(COUNT(F14,I14)=2,F14-I14,\"n.a.\")","v":{"v":0,"d":"0.00"}},{"$f":"IF(COUNT(D14:F14)=0,\"No actual entered\",IF(COUNT(D14:F14)<3,\"Complete yellow inputs\",IF(ISNUMBER(I14),IF(ABS(F14-I14)>0.01,\"Reconcile bank difference\",\"Recorded\"),\"Prior opening cash needed\")))","v":"Recorded"}]
[null,"2026-09-28",{"$f":"IF(COUNTIFS('Forecast'!$C$12:$O$12,B15)=1,INDEX('Forecast'!$C$26:$O$26,1,MATCH(B15,'Forecast'!$C$12:$O$12,0)),\"Outside forecast\")","v":{"v":22000,"d":"€22,000"}},{"v":16000,"d":"€16,000"},{"v":38000,"d":"€38,000"},{"v":18000,"d":"€18,000"},{"$f":"IF(ISNUMBER(F15),IF(ISNUMBER(C15),F15-C15,\"n.a.\"),\"No actual\")","v":{"v":-4000,"d":"(€4,000)"}},{"$f":"IF(ISNUMBER(G15),IF(C15=0,\"n.a.\",G15/ABS(C15)),\"n.a.\")","v":{"v":-0.18181818181818182,"d":"(18.2%)"}},{"$f":"IF(COUNT(D15:E15)=2,IF(AND(ISNUMBER(F14),B15=B14+7),F14+D15-E15,\"n.a.\"),\"n.a.\")","v":{"v":18000,"d":"€18,000"}},{"$f":"IF(COUNT(F15,I15)=2,F15-I15,\"n.a.\")","v":{"v":0,"d":"0.00"}},{"$f":"IF(COUNT(D15:F15)=0,\"No actual entered\",IF(COUNT(D15:F15)<3,\"Complete yellow inputs\",IF(ISNUMBER(I15),IF(ABS(F15-I15)>0.01,\"Reconcile bank difference\",\"Recorded\"),\"Prior opening cash needed\")))","v":"Recorded"}]
[null,"2026-10-05",{"$f":"IF(COUNTIFS('Forecast'!$C$12:$O$12,B16)=1,INDEX('Forecast'!$C$26:$O$26,1,MATCH(B16,'Forecast'!$C$12:$O$12,0)),\"Outside forecast\")","v":{"v":40000,"d":"€40,000"}},{"$nulls":3},{"$f":"IF(ISNUMBER(F16),IF(ISNUMBER(C16),F16-C16,\"n.a.\"),\"No actual\")","v":"No actual"},{"$f":"IF(ISNUMBER(G16),IF(C16=0,\"n.a.\",G16/ABS(C16)),\"n.a.\")","v":"n.a."},{"$f":"IF(COUNT(D16:E16)=2,IF(AND(ISNUMBER(F15),B16=B15+7),F15+D16-E16,\"n.a.\"),\"n.a.\")","v":"n.a."},{"$f":"IF(COUNT(F16,I16)=2,F16-I16,\"n.a.\")","v":"n.a."},{"$f":"IF(COUNT(D16:F16)=0,\"No actual entered\",IF(COUNT(D16:F16)<3,\"Complete yellow inputs\",IF(ISNUMBER(I16),IF(ABS(F16-I16)>0.01,\"Reconcile bank difference\",\"Recorded\"),\"Prior opening cash needed\")))","v":"No actual entered"}]
[null,"2026-10-12",{"$f":"IF(COUNTIFS('Forecast'!$C$12:$O$12,B17)=1,INDEX('Forecast'!$C$26:$O$26,1,MATCH(B17,'Forecast'!$C$12:$O$12,0)),\"Outside forecast\")","v":{"v":34000,"d":"€34,000"}},{"$nulls":3},{"$f":"IF(ISNUMBER(F17),IF(ISNUMBER(C17),F17-C17,\"n.a.\"),\"No actual\")","v":"No actual"},{"$f":"IF(ISNUMBER(G17),IF(C17=0,\"n.a.\",G17/ABS(C17)),\"n.a.\")","v":"n.a."},{"$f":"IF(COUNT(D17:E17)=2,IF(AND(ISNUMBER(F16),B17=B16+7),F16+D17-E17,\"n.a.\"),\"n.a.\")","v":"n.a."},{"$f":"IF(COUNT(F17,I17)=2,F17-I17,\"n.a.\")","v":"n.a."},{"$f":"IF(COUNT(D17:F17)=0,\"No actual entered\",IF(COUNT(D17:F17)<3,\"Complete yellow inputs\",IF(ISNUMBER(I17),IF(ABS(F17-I17)>0.01,\"Reconcile bank difference\",\"Recorded\"),\"Prior opening cash needed\")))","v":"No actual entered"}]
[null,"2026-10-19",{"$f":"IF(COUNTIFS('Forecast'!$C$12:$O$12,B18)=1,INDEX('Forecast'!$C$26:$O$26,1,MATCH(B18,'Forecast'!$C$12:$O$12,0)),\"Outside forecast\")","v":{"v":41000,"d":"€41,000"}},{"$nulls":3},{"$f":"IF(ISNUMBER(F18),IF(ISNUMBER(C18),F18-C18,\"n.a.\"),\"No actual\")","v":"No actual"},{"$f":"IF(ISNUMBER(G18),IF(C18=0,\"n.a.\",G18/ABS(C18)),\"n.a.\")","v":"n.a."},{"$f":"IF(COUNT(D18:E18)=2,IF(AND(ISNUMBER(F17),B18=B17+7),F17+D18-E18,\"n.a.\"),\"n.a.\")","v":"n.a."},{"$f":"IF(COUNT(F18,I18)=2,F18-I18,\"n.a.\")","v":"n.a."},{"$f":"IF(COUNT(D18:F18)=0,\"No actual entered\",IF(COUNT(D18:F18)<3,\"Complete yellow inputs\",IF(ISNUMBER(I18),IF(ABS(F18-I18)>0.01,\"Reconcile bank difference\",\"Recorded\"),\"Prior opening cash needed\")))","v":"No actual entered"}]
[null,"2026-10-26",{"$f":"IF(COUNTIFS('Forecast'!$C$12:$O$12,B19)=1,INDEX('Forecast'!$C$26:$O$26,1,MATCH(B19,'Forecast'!$C$12:$O$12,0)),\"Outside forecast\")","v":{"v":36000,"d":"€36,000"}},{"$nulls":3},{"$f":"IF(ISNUMBER(F19),IF(ISNUMBER(C19),F19-C19,\"n.a.\"),\"No actual\")","v":"No actual"},{"$f":"IF(ISNUMBER(G19),IF(C19=0,\"n.a.\",G19/ABS(C19)),\"n.a.\")","v":"n.a."},{"$f":"IF(COUNT(D19:E19)=2,IF(AND(ISNUMBER(F18),B19=B18+7),F18+D19-E19,\"n.a.\"),\"n.a.\")","v":"n.a."},{"$f":"IF(COUNT(F19,I19)=2,F19-I19,\"n.a.\")","v":"n.a."},{"$f":"IF(COUNT(D19:F19)=0,\"No actual entered\",IF(COUNT(D19:F19)<3,\"Complete yellow inputs\",IF(ISNUMBER(I19),IF(ABS(F19-I19)>0.01,\"Reconcile bank difference\",\"Recorded\"),\"Prior opening cash needed\")))","v":"No actual entered"}]
[null,"2026-11-02",{"$f":"IF(COUNTIFS('Forecast'!$C$12:$O$12,B20)=1,INDEX('Forecast'!$C$26:$O$26,1,MATCH(B20,'Forecast'!$C$12:$O$12,0)),\"Outside forecast\")","v":{"v":46000,"d":"€46,000"}},{"$nulls":3},{"$f":"IF(ISNUMBER(F20),IF(ISNUMBER(C20),F20-C20,\"n.a.\"),\"No actual\")","v":"No actual"},{"$f":"IF(ISNUMBER(G20),IF(C20=0,\"n.a.\",G20/ABS(C20)),\"n.a.\")","v":"n.a."},{"$f":"IF(COUNT(D20:E20)=2,IF(AND(ISNUMBER(F19),B20=B19+7),F19+D20-E20,\"n.a.\"),\"n.a.\")","v":"n.a."},{"$f":"IF(COUNT(F20,I20)=2,F20-I20,\"n.a.\")","v":"n.a."},{"$f":"IF(COUNT(D20:F20)=0,\"No actual entered\",IF(COUNT(D20:F20)<3,\"Complete yellow inputs\",IF(ISNUMBER(I20),IF(ABS(F20-I20)>0.01,\"Reconcile bank difference\",\"Recorded\"),\"Prior opening cash needed\")))","v":"No actual entered"}]
{"$rows_left_out":13}
{"sheet":"Guide","index":2,"n_rows":40,"n_cols":11,"rows_kept":40}
[]
[null,"BriQs Group: using the cash forecast",{"$nulls":6},"Case selected:",null,{"$f":"CHOOSE('Forecast'!$O$4,\"Base\",\"Downside\")","v":"Base"}]
[]
[]
[null,"A practical weekly cash view"]
[null,"This workbook uses EUR cash amounts. All prefilled forecast and actual figures are synthetic illustrations."]
[]
[null,"1. Set the starting position"]
[null,"On Forecast, set the Monday start date, opening cash balance and minimum cash you want to retain."]
[null,"Opening cash should be the cash available immediately before week 1. Use the same bank-account scope throughout."]
[]
[null,"2. Replace the yellow forecast inputs"]
[null,"Enter customer collections for Base and Downside. Select 1 for Base or 2 for Downside in the case-number cell."]
[null,"The Downside example reduces customer collections. Other receipts and every payment category are shared."]
[null,"Enter receipts and payments as positive amounts, in the week cash is expected to reach or leave the bank."]
[null,"Enter 0 when an amount is genuinely zero. A blank required forecast input makes its dependent cash results unavailable."]
[]
[null,"3. Review cash before the week begins"]
[null,"Closing cash = opening cash + total cash receipts − total cash payments. It becomes the next week’s opening cash."]
[null,"Headroom = closing cash − minimum cash. A negative amount and red warning identify a shortfall against your minimum."]
{"$rows_left_out":20}